Crystal error: error ocurred reading records: error in compiling sql expression 
Author Message
 Crystal error: error ocurred reading records: error in compiling sql expression

I seem to randomly get the the following error on some of
my crystal enterprise reports that are accessed through the web
browser with active plugin.

error ocurred reading records: error in compiling sql expression

We are running crystal enterprise 8, Crystal Reports 8.5. I am running
SQL Server Server 7.0



Sat, 20 Mar 2004 22:55:20 GMT  
 
 [ 1 post ] 

 Relevant Pages 

1. Error 20639: SQL Expression error - Error in creating SQL Expression COM Parser (cpeaut32)

2. Compile error: Automation error, Error 32811: Unexpected error

3. Bogus, Intermittent Compile Error: Constant Expression Required

4. Compile error: Automation error

5. Compile Error : Automation Error

6. Error message: Compile error in hidden module

7. Compile Error - Permission Denied (Error 70)

8. VB6 - Compile error: error in loading dll

9. Use of IsNull() in SQL expression and Error 3085 (VB4-16

10. Error in creating SQL Expression COM Parser?

11. SQL Expression Field - SELECT error

12. Error 3075: function isn't available in expressions in query expression

 

 
Powered by phpBB® Forum Software