Problems compiling itcl 2.0 on Linux 1.2.13 
Author Message
 Problems compiling itcl 2.0 on Linux 1.2.13

I'm having some trouble getting itcl 2.0 to compile on Linux 1.2.13.  
I get the following errors after running ./configure.  Has anyone
encountered this sort of problem before, or know what's causing it?

Thanks,

-Mike

=========

for dir in tcl7.4 tk4.0 itcl itk iwidgets2.0.0 ; do \
        (cd $dir; make all) \
done;
make[1]: Entering directory `/usr/local/src/itcl2.0/tcl7.4'
cc -c -O -I. -I. -DNO_DIRENT_H=1 -DNO_ERRNO_H=1 -DNO_LIMITS_H=1
-DNO_STDLIB_H=1 -DNO_SYS_TIME_H=1 -DNO_SYS_WAIT_H=1 -Dmode_t=int
-Dpid_t=int -Dsize_t=unsigned -Duid_t=int -Dgid_t=int
-DNO_UNION_WAIT=1 -Dvfork=fork
-DTCL_LIBRARY=\"/usr/local/itcl/lib/tcl7.4\" tclUnixAZ.c
In file included from tclInt.h:40,
                 from tclUnixAZ.c:19:
/usr/include/stdio.h:71: warning: empty declaration
In file included from /usr/include/sys/types.h:4,
                 from /usr/include/fcntl.h:27,
                 from tclPort.h:29,
                 from tclUnixAZ.c:20:
/usr/include/linux/types.h:20: warning: empty declaration
/usr/include/linux/types.h:21: warning: empty declaration
/usr/include/linux/types.h:22: warning: empty declaration
/usr/include/linux/types.h:25: warning: empty declaration
tclUnixAZ.c: In function `Tcl_TimeCmd':
tclUnixAZ.c:1813: storage size of `start' isn't known
tclUnixAZ.c:1813: storage size of `stop' isn't known
tclUnixAZ.c:1814: storage size of `tz' isn't known
make[1]: *** [tclUnixAZ.o] Error 1
make[1]: Leaving directory `/usr/local/src/itcl2.0/tcl7.4'
make[1]: Entering directory `/usr/local/src/itcl2.0/tk4.0'
cc -c -O -I. -I./../tcl7.4 -I/usr/X11R6/include -DNO_FD_SET=1
-Dmode_t=int -Dpid_t=int -Dsize_t=unsigned -Duid_t=int -Dgid_t=int
-DTK_FILE_READ_PTR=1      -DTK_LIBRARY=\"/usr/local/itcl/lib/tk4.0\"
tk3d.c
In file included from tkPort.h:35,
                 from tk3d.c:16:
/usr/include/stdio.h:71: warning: empty declaration
In file included from /usr/include/sys/types.h:4,
                 from /usr/include/fcntl.h:27,
                 from tkPort.h:37,
                 from tk3d.c:16:
/usr/include/linux/types.h:20: warning: empty declaration
/usr/include/linux/types.h:21: warning: empty declaration
/usr/include/linux/types.h:22: warning: empty declaration
/usr/include/linux/types.h:25: warning: empty declaration
In file included from tk3d.c:16:
tkPort.h:90: conflicting types for `fd_mask'
/usr/include/sys/types.h:15: previous declaration of `fd_mask'
make[1]: *** [tk3d.o] Error 1
make[1]: Leaving directory `/usr/local/src/itcl2.0/tk4.0'
make[1]: Entering directory `/usr/local/src/itcl2.0/itcl'
cc -O -Wshadow -Wtraditional -Wall -I. -I. -I./../tcl7.4
-DNO_LIMITS_H=1 -DNO_STDLIB_H=1 -Dmode_t=int -Dpid_t=int
-Dsize_t=unsigned -Duid_t=int -Dgid_t=int
-DITCL_LIBRARY=\"/usr/local/itcl/lib/itcl2.0\" tclAppInit.o libitcl.a
./tcl7.4/libtcl.a  -lieee -lm -o itclsh
cc: ../tcl7.4/libtcl.a: No such file or directory
make[1]: *** [itclsh] Error 1
make[1]: Leaving directory `/usr/local/src/itcl2.0/itcl'
make[1]: Entering directory `/usr/local/src/itcl2.0/itk'
cc -O -Wshadow -Wtraditional -Wall -I. -I./../tcl7.4 -I./../itcl
-I./../tk4.0 -I/usr/X11R6/include -DNO_LIMITS_H=1 -DNO_STDLIB_H=1
-Dmode_t=int -Dpid_t=int -Dsize_t=unsigned -Duid_t=int -Dgid_t=int
-DITK_LIBRARY=\"/usr/local/itcl/lib/itk2.0\" tkAppInit.o libitk.a
./tk4.0/libtk.a ../itcl/libitcl.a ../tcl7.4/libtcl.a -L/usr/X11R6/lib
-lX11  -lieee -lm -o itkwish
cc: ../tk4.0/libtk.a: No such file or directory
cc: ../tcl7.4/libtcl.a: No such file or directory
make[1]: *** [itkwish] Error 1
make[1]: Leaving directory `/usr/local/src/itcl2.0/itk'
make[1]: Entering directory `/usr/local/src/itcl2.0/iwidgets2.0.0'
cat ./init.iwidgets.in \

        > init.iwidgets
make[1]: Leaving directory `/usr/local/src/itcl2.0/iwidgets2.0.0'
--


Canada



Wed, 09 Sep 1998 03:00:00 GMT  
 
 [ 1 post ] 

 Relevant Pages 

1. Compiling under Linux 1.2.13 - err.log (0/1)

2. problems with libtcl7.5.so on linux 1.2.13

3. Help with Gnat 3.01 on Linux 1.2.13

4. Tcl 7.6 Linux 1.2.13 clock.test fix

5. Linux 1.2.13 Compilation notes for tcl7.5 and 7.5p1, tk4.1

6. Tcl 7.5 clock error on Linux 1.2.13

7. Tk 4.1 colour error on Linux 1.2.13

8. Running out of ptys with Expect 5.18 and Linux 1.2.13

9. GNU Prolog 1.2.13 is available

10. Compiling Itcl 3.0.1 on Linux.

11. Trouble compiling itcl-1.5, blt-1.8 under Linux

12. tk_popup problem in itcl 2.0

 

 
Powered by phpBB® Forum Software