5.8.0 build problem on HPUX 10.26 (a variant of 10.20) 
Author Message
 5.8.0 build problem on HPUX 10.26 (a variant of 10.20)

Pointers as to what the testa are testing or why they might have
failed would be appreciated :)

joe

lib/ExtUtils/t/INST..................ok
lib/ExtUtils/t/Installed.............#     Failed test
(../lib/ExtUtils/t/Installed.t at line 161)
#          got: '0'
#     expected: '1'
FAILED at test 29
lib/ExtUtils/t/INST_PREFIX...........ok
lib/ExtUtils/t/Manifest..............ok
lib/ExtUtils/t/Mkbootstrap...........#     Failed test
(../lib/ExtUtils/t/Mkbootstrap.t at line 87)
#                   ''
#     doesn't match '(?-xism:Unable to open dasboot\.bs)'
FAILED at test 8
lib/ExtUtils/t/MM_BeOS...............skipping test on this platform
lib/ExtUtils/t/MM_Cygwin.............skipping test on this platform
lib/ExtUtils/t/MM_NW5................skipping test on this platform
lib/ExtUtils/t/MM_OS2................skipping test on this platform
lib/ExtUtils/t/MM_Unix...............ok
lib/ExtUtils/t/MM_VMS................skipping test on this platform
lib/ExtUtils/t/MM_Win32..............skipping test on this platform
lib/ExtUtils/t/Packlist..............#     Failed test
(../lib/ExtUtils/t/Packlist.t at line 98)
#                   ''
#     doesn't match '(?-xism:Can't open file)'
FAILED at test 17
lib/ExtUtils/t/prefixify.............ok
...
t/x2p/s2p............................ok
Failed 3 test scripts out of 661, 99.55% okay.



Sun, 26 Jun 2005 07:01:44 GMT  
 
 [ 1 post ] 

 Relevant Pages 

1. Problem building perl on HPUX 10.20

2. Trouble building perl modules on HPUX 10.20

3. building perl on hpux 10.20 with +O3

4. Trouble building perl modules on HPUX 10.20

5. Problem with Socket.pm/Socket.sl on HPUX 10.20

6. Expect.pm and HPUX 10.20

7. Comm.pl on hpux 10.20

8. tkperl on HPUX 10.20

9. DB_File - HPUX 10.20

10. DBD::Oracle Unresolved Symbol error with make test on HPUX 10.20

11. inet_ntoa on HPUX 10.20

12. perlcc in HPUX 10.20

 

 
Powered by phpBB® Forum Software