GD 1.14 install problems 
Author Message
 GD 1.14 install problems

can anybody help? i am trying to install GD-1.14
on a Sun 4.1.3 fileserver ... i've untar'd the file,
ran perl Makefile.PL ...but when i go to run the
make, i get these errors ...
============================================================
DEFINE=''; export DEFINE INC; \
cd libgd && make -e
cc -c  -O -DVERSION=\"0.10\" -DXS_VERSION=\"0.10\" -pic
-I/usr/local/lib/perl5/sun4-sunos/5.002/CORE  gdfontg.c
"./gd.h", line 85: syntax error at or near type word "int"
"./gd.h", line 86: syntax error at or near word "struct"
"./gd.h", line 87: syntax error at or near word "struct"
"./gd.h", line 88: syntax error at or near word "struct"
"./gd.h", line 89: syntax error at or near variable name "im"
"./gd.h", line 89: gdImagePtr declared as parameter to non-function
"./gd.h", line 90: syntax error at or near variable name "im"
"./gd.h", line 90: gdImagePtr declared as parameter to non-function
"./gd.h", line 91: syntax error at or near variable name "im"
"./gd.h", line 91: gdImagePtr declared as parameter to non-function
"./gd.h", line 92: syntax error at or near variable name "im"
"./gd.h", line 92: gdImagePtr declared as parameter to non-function
"./gd.h", line 95: syntax error at or near variable name "im"
"./gd.h", line 95: gdImagePtr declared as parameter to non-function
"./gd.h", line 98: syntax error at or near variable name "im"
"./gd.h", line 98: gdImagePtr declared as parameter to non-function
"./gd.h", line 100: syntax error at or near variable name "im"
"./gd.h", line 100: gdImagePtr declared as parameter to non-function
"./gd.h", line 101: syntax error at or near variable name "im"
"./gd.h", line 101: gdImagePtr declared as parameter to non-function
"./gd.h", line 102: syntax error at or near variable name "im"
"./gd.h", line 102: gdImagePtr declared as parameter to non-function
"./gd.h", line 103: syntax error at or near variable name "im"
"./gd.h", line 103: gdImagePtr declared as parameter to non-function
"./gd.h", line 104: syntax error at or near variable name "im"
"./gd.h", line 104: gdImagePtr declared as parameter to non-function
"./gd.h", line 105: syntax error at or near variable name "im"
"./gd.h", line 105: gdImagePtr declared as parameter to non-function
"./gd.h", line 113: syntax error at or near variable name "im"
"./gd.h", line 113: gdImagePtr declared as parameter to non-function
"./gd.h", line 114: syntax error at or near variable name "im"
"./gd.h", line 114: fatal error: too many errors
Compilation failed
*** Error code 1
make: Fatal error: Command failed for target `gdfontg.o'
==================================================================
i've looked at the gd.h file, but don't see any glaring errors ...

has anybody else ran into this? apologies all round
if this has been covered & i missed it ...

email replies are fine.

thanks in advance ...
--
***************************************************
Kimberlee Crissman
Systems Support / The Houston Chronicle
work: 713-220-7757 / fax:713-250-3153

'Online, no one can hear you scream.'
***************************************************



Sat, 20 Mar 1999 03:00:00 GMT  
 GD 1.14 install problems

did you install thomas boutell's  gd1.2 C library first?
GD1.4 is just a module that interfaces with the C library.

I have had my own utterly frustrating experiences with GD1.14, see a following
post.


Quote:

> can anybody help? i am trying to install GD-1.14
> on a Sun 4.1.3 fileserver ... i've untar'd the file,
> ran perl Makefile.PL ...but when i go to run the
> make, i get these errors ...
> ============================================================
> DEFINE=''; export DEFINE INC; \
> cd libgd && make -e
> cc -c  -O -DVERSION=\"0.10\" -DXS_VERSION=\"0.10\" -pic
> -I/usr/local/lib/perl5/sun4-sunos/5.002/CORE  gdfontg.c
> "./gd.h", line 85: syntax error at or near type word "int"
> "./gd.h", line 86: syntax error at or near word "struct"
> "./gd.h", line 87: syntax error at or near word "struct"
> "./gd.h", line 88: syntax error at or near word "struct"
> "./gd.h", line 89: syntax error at or near variable name "im"
> "./gd.h", line 89: gdImagePtr declared as parameter to non-function
> "./gd.h", line 90: syntax error at or near variable name "im"
> "./gd.h", line 90: gdImagePtr declared as parameter to non-function
> "./gd.h", line 91: syntax error at or near variable name "im"
> "./gd.h", line 91: gdImagePtr declared as parameter to non-function
> "./gd.h", line 92: syntax error at or near variable name "im"
> "./gd.h", line 92: gdImagePtr declared as parameter to non-function
> "./gd.h", line 95: syntax error at or near variable name "im"
> "./gd.h", line 95: gdImagePtr declared as parameter to non-function
> "./gd.h", line 98: syntax error at or near variable name "im"
> "./gd.h", line 98: gdImagePtr declared as parameter to non-function
> "./gd.h", line 100: syntax error at or near variable name "im"
> "./gd.h", line 100: gdImagePtr declared as parameter to non-function
> "./gd.h", line 101: syntax error at or near variable name "im"
> "./gd.h", line 101: gdImagePtr declared as parameter to non-function
> "./gd.h", line 102: syntax error at or near variable name "im"
> "./gd.h", line 102: gdImagePtr declared as parameter to non-function
> "./gd.h", line 103: syntax error at or near variable name "im"
> "./gd.h", line 103: gdImagePtr declared as parameter to non-function
> "./gd.h", line 104: syntax error at or near variable name "im"
> "./gd.h", line 104: gdImagePtr declared as parameter to non-function
> "./gd.h", line 105: syntax error at or near variable name "im"
> "./gd.h", line 105: gdImagePtr declared as parameter to non-function
> "./gd.h", line 113: syntax error at or near variable name "im"
> "./gd.h", line 113: gdImagePtr declared as parameter to non-function
> "./gd.h", line 114: syntax error at or near variable name "im"
> "./gd.h", line 114: fatal error: too many errors
> Compilation failed
> *** Error code 1
> make: Fatal error: Command failed for target `gdfontg.o'
> ==================================================================
> i've looked at the gd.h file, but don't see any glaring errors ...

> has anybody else ran into this? apologies all round
> if this has been covered & i missed it ...

> email replies are fine.

> thanks in advance ...
> --
> ***************************************************
> Kimberlee Crissman
> Systems Support / The Houston Chronicle
> work: 713-220-7757 / fax:713-250-3153

> 'Online, no one can hear you scream.'
> ***************************************************



Sat, 20 Mar 1999 03:00:00 GMT  
 GD 1.14 install problems

|> did you install thomas boutell's  gd1.2 C library first?
|> GD1.4 is just a module that interfaces with the C library.

As far ar I know the GD-1.14 comes with a modified gd library sources
which it compiles while building the module.  See the GD-1.14/libgd
directory.  The GD-1.14/README file says that it does,

|> I have had my own utterly frustrating experiences with GD1.14, see a following
|> post.
|>

|>
|> > can anybody help? i am trying to install GD-1.14
|> > on a Sun 4.1.3 fileserver ... i've untar'd the file,
|> > ran perl Makefile.PL ...but when i go to run the
|> > make, i get these errors ...
|> >
|> > i've looked at the gd.h file, but don't see any glaring errors ...
|> >
|> > has anybody else ran into this? apologies all round
|> > if this has been covered & i missed it ...

I have not had this problem, but I cannot build GD-1.14 either.  I get
the following error:

Running Mkbootstrap for GD ()
chmod 644 GD.bs
LD_RUN_PATH="" ld -o blib/arch/auto/GD/GD.so -H512 -T512 -bhalt:4 -bM:SRE -bI:/dept/phys/photon3/usr/perl/aix/lib/aix/5.003/CORE/perl.exp -bE:GD.exp -b noentry -lc -L/dept/phys/photon3/usr/lib/rs_aix41 -L/usr/local/lib GD.o  libgd/libgd.a  
ld: 0711-317 ERROR: Undefined symbol: .floor
ld: 0711-345 Use the -bloadmap or -bnoquiet option to obtain more information.
gnumake: *** [blib/arch/auto/GD/GD.so] Error 8

I am on an IBM RS/6000 running AIX 4.1.4.0 with perl5.003.  As far as
I can tell I get this error because the math library (-lm) is not
included on the link line.  I manually ran ld with -lm included and
was able to build this module.  Has this already been fixed?

|> > email replies are fine.
|> >
|> > thanks in advance ...
|> > --
|> > ***************************************************
|> > Kimberlee Crissman
|> > Systems Support / The Houston Chronicle
|> > work: 713-220-7757 / fax:713-250-3153

|> > 'Online, no one can hear you scream.'
|> > ***************************************************

--

Physics Department                  Phone:      (518)276-2050
Rensselaer Polytechnic Institute    FAX:        (518)276-6680
Troy, NY 12180-3590                 WWW: http://www.rpi.edu/~smithj4/



Sun, 21 Mar 1999 03:00:00 GMT  
 
 [ 3 post ] 

 Relevant Pages 

1. [Fwd: Re: GD 1.14 install problems]

2. GD 1.14 NT install problems

3. Problem with IO 1.14

4. GD install problem, can't find gd.h

5. GD: Problem in installing GD 1.20-1.27

6. Source: newgetopt.pl version 1.14

7. FAQ 1.14 What is a JAPH?

8. FAQ 1.14 What is a JAPH?

9. FAQ 1.14 What is a JAPH?

10. FAQ 1.14 What is a JAPH?

11. FAQ 1.14 What is a JAPH?

12. FAQ 1.14 What is a JAPH?

 

 
Powered by phpBB® Forum Software