Q: Errors installing URI-1.00.tar.gz over ActivePerl 509 
Author Message
 Q: Errors installing URI-1.00.tar.gz over ActivePerl 509

Any ideas? And, yes, it did install completely, as you can see.

This is the log of phase 2 of my install...

Quote:
> cd C:\Perl\Scripts\General
> makeModule 2 URI 1.00

C:\Perl\Scripts\General>makeModule 2 URI 1.00

C:\Perl\Scripts\General>
C:\Perl\Scripts\General>C:

C:\Perl\Scripts\General>cd \Temp

C:\Temp>
C:\Temp>if !2! == !1! goto phase1

C:\Temp>if !2! == !2! goto phase2

C:\Temp>
C:\Temp>cd URI-1.00

C:\Temp\URI-1.00>
C:\Temp\URI-1.00>call vcvars32
Setting environment for using Microsoft Visual C++ tools.
C:\Temp\URI-1.00>
C:\Temp\URI-1.00>nmake

Microsoft (R) Program Maintenance Utility   Version 1.62.7022
Copyright (C) Microsoft Corp 1988-1997. All rights reserved.

mkdir blib
mkdir blib\lib
mkdir blib\arch
mkdir blib\arch\auto
mkdir blib\arch\auto\URI
mkdir blib\lib\auto
mkdir blib\lib\auto\URI
mkdir blib\man3
cp URI/_server.pm blib\lib\URI\_server.pm
cp URI/WithBase.pm blib\lib\URI\WithBase.pm
cp URI/_login.pm blib\lib\URI\_login.pm
cp URI/data.pm blib\lib\URI\data.pm
cp URI/_generic.pm blib\lib\URI\_generic.pm
cp URI/news.pm blib\lib\URI\news.pm
cp URI/file.pm blib\lib\URI\file.pm
cp URI/file/Mac.pm blib\lib\URI\file\Mac.pm
cp URI/nntp.pm blib\lib\URI\nntp.pm
cp URI/http.pm blib\lib\URI\http.pm
cp URI/file/Win32.pm blib\lib\URI\file\Win32.pm
cp URI/file/OS2.pm blib\lib\URI\file\OS2.pm
cp URI/gopher.pm blib\lib\URI\gopher.pm
cp URI/mailto.pm blib\lib\URI\mailto.pm
cp URI/_foreign.pm blib\lib\URI\_foreign.pm
cp URI/ftp.pm blib\lib\URI\ftp.pm
cp URI/file/Base.pm blib\lib\URI\file\Base.pm
cp URI/file/FAT.pm blib\lib\URI\file\FAT.pm
cp URI/rlogin.pm blib\lib\URI\rlogin.pm
cp URI/telnet.pm blib\lib\URI\telnet.pm
cp URI/pop.pm blib\lib\URI\pop.pm
cp URI/snews.pm blib\lib\URI\snews.pm
cp URI/Heuristic.pm blib\lib\URI\Heuristic.pm
cp URI.pm blib\lib\URI.pm
cp URI/Escape.pm blib\lib\URI\Escape.pm
cp URI/_segment.pm blib\lib\URI\_segment.pm
cp URI/file/Unix.pm blib\lib\URI\file\Unix.pm
cp URI/URL.pm blib\lib\URI\URL.pm
cp URI/https.pm blib\lib\URI\https.pm
cp URI/_userpass.pm blib\lib\URI\_userpass.pm
cp URI/_query.pm blib\lib\URI\_query.pm

C:\Temp\URI-1.00>nmake test

Microsoft (R) Program Maintenance Utility   Version 1.62.7022
Copyright (C) Microsoft Corp 1988-1997. All rights reserved.

 C:\PERL\BIN\PERL.EXE -Mblib -IC:\Perl\lib -IC:\Perl\lib -e "use

t\data.t t\file.t t\generic.t t\heuristic.t t\http.t t\mailto.t t\mix.t
t\news.t t\old-absconf.t t\old-base.t t\old-relbase.t t\pop.t t\roy-test.t
Using C:/Temp/URI-1.00/blib
t\abs...............ok
t\data..............ok
t\file..............Bad command or file name
ok
t\generic...........ok
t\heuristic.........Bad command or file name
ok
t\http..............ok
t\mailto............ok
t\mix...............ok
t\news..............ok
t\old-absconf.......ok
t\old-base..........Bad command or file name
'file://C:/Temp/'->as_string() = 'file://C:/Temp/' (expected
'file:C%3A/Temp/')
$VAR1 = bless( [
                 bless( do{\(my $o = 'file://C:/Temp/')}, 'URI::file' )
               ], 'URI::URL' );
Test Failed at t\old-base.t line 22
 URI::URL::_expect('file://C:/Temp/', 'as_string', 'file:C%3A/Temp/') called
at t\old-base.t line 645
 main::newlocal_test() called at t\old-base.t line 55
dubious
 Test returned status 2 (wstat 512, 0x200)
DIED. FAILED tests 4-8
 Failed 5/8 tests, 37.50% okay
t\old-relbase.......ok
t\pop...............ok
t\roy-test..........ok
Failed Test  Status Wstat Total Fail  Failed  List of failed
----------------------------------------------------------------------------
---
t\old-base.t      2   512     8    5  62.50%  4-8
Failed 1/14 test scripts, 92.86% okay. 5/295 subtests failed, 98.31% okay.
NMAKE : fatal error U1077: 'C:\PERL\BIN\PERL.exe' : return code '0xff'
Stop.

C:\Temp\URI-1.00>nmake install

Microsoft (R) Program Maintenance Utility   Version 1.62.7022
Copyright (C) Microsoft Corp 1988-1997. All rights reserved.

Installing C:\Perl\Site\5.00502\Lib\URI\_server.pm
Installing C:\Perl\Site\5.00502\Lib\URI\WithBase.pm
Installing C:\Perl\Site\5.00502\Lib\URI\_login.pm
Installing C:\Perl\Site\5.00502\Lib\URI\data.pm
Installing C:\Perl\Site\5.00502\Lib\URI\_generic.pm
Installing C:\Perl\Site\5.00502\Lib\URI\news.pm
Installing C:\Perl\Site\5.00502\Lib\URI\file.pm
Installing C:\Perl\Site\5.00502\Lib\URI\file\Mac.pm
Installing C:\Perl\Site\5.00502\Lib\URI\file\Win32.pm
Installing C:\Perl\Site\5.00502\Lib\URI\file\OS2.pm
Installing C:\Perl\Site\5.00502\Lib\URI\file\Base.pm
Installing C:\Perl\Site\5.00502\Lib\URI\file\FAT.pm
Installing C:\Perl\Site\5.00502\Lib\URI\file\Unix.pm
Installing C:\Perl\Site\5.00502\Lib\URI\nntp.pm
Installing C:\Perl\Site\5.00502\Lib\URI\http.pm
Installing C:\Perl\Site\5.00502\Lib\URI\gopher.pm
Installing C:\Perl\Site\5.00502\Lib\URI\mailto.pm
Installing C:\Perl\Site\5.00502\Lib\URI\_foreign.pm
Installing C:\Perl\Site\5.00502\Lib\URI\ftp.pm
Installing C:\Perl\Site\5.00502\Lib\URI\rlogin.pm
Installing C:\Perl\Site\5.00502\Lib\URI\telnet.pm
Installing C:\Perl\Site\5.00502\Lib\URI\pop.pm
Installing C:\Perl\Site\5.00502\Lib\URI\snews.pm
Installing C:\Perl\Site\5.00502\Lib\URI\Heuristic.pm
Installing C:\Perl\Site\5.00502\Lib\URI\Escape.pm
Installing C:\Perl\Site\5.00502\Lib\URI\_segment.pm
Installing C:\Perl\Site\5.00502\Lib\URI\URL.pm
Installing C:\Perl\Site\5.00502\Lib\URI\https.pm
Installing C:\Perl\Site\5.00502\Lib\URI\_userpass.pm
Installing C:\Perl\Site\5.00502\Lib\URI\_query.pm
Installing C:\Perl\Site\5.00502\Lib\URI.pm
Writing C:\Perl\Site\5.00502\Lib\MSWin32-x86-object\auto\URI\.packlist
## Differing versions of URI/Escape.pm found. You might like to
rm C:\PERL\site\lib\URI\Escape.pm
rm C:\Perl\site\lib\URI\Escape.pm
## Differing versions of URI/Heuristic.pm found. You might like to
rm C:\PERL\site\lib\URI\Heuristic.pm
rm C:\Perl\site\lib\URI\Heuristic.pm
## Differing versions of URI/URL.pm found. You might like to
rm C:\PERL\site\lib\URI\URL.pm
rm C:\Perl\site\lib\URI\URL.pm
## Running 'make install UNINST=1' will unlink all those files for you.
Appending installation info to
C:\Perl\Site\5.00502\Lib\MSWin32-x86-object/perllocal.pod

C:\Temp\URI-1.00>
C:\Temp\URI-1.00>cd ..

C:\Temp>
C:\Temp>del URI-1.00.tar.gz

C:\Temp>
C:\Temp>deltree /y URI-1.00
Deleting URI-1.00...

C:\Temp>
C:\Temp>
C:\Temp>cd \Temp

C:\Temp>

--
Ron Savage


http://www.*-*-*.com/ ~rpsavage



Mon, 23 Jul 2001 03:00:00 GMT  
 Q: Errors installing URI-1.00.tar.gz over ActivePerl 509
On Thu, 4 Feb 1999 10:36:45 +1100,

Quote:
>Any ideas? And, yes, it did install completely, as you can see.
>> makeModule 2 URI 1.00
[snip]
>t\abs...............ok
>t\data..............ok
>t\file..............Bad command or file name
>ok
>t\generic...........ok
>t\heuristic.........Bad command or file name
>ok
>t\http..............ok
>t\mailto............ok
>t\mix...............ok
>t\news..............ok
>t\old-absconf.......ok
>t\old-base..........Bad command or file name
>'file://C:/Temp/'->as_string() = 'file://C:/Temp/' (expected
>'file:C%3A/Temp/')
>$VAR1 = bless( [
>                 bless( do{\(my $o = 'file://C:/Temp/')}, 'URI::file' )
>               ], 'URI::URL' );
>Test Failed at t\old-base.t line 22
> URI::URL::_expect('file://C:/Temp/', 'as_string', 'file:C%3A/Temp/') called
>at t\old-base.t line 645
> main::newlocal_test() called at t\old-base.t line 55
>dubious
> Test returned status 2 (wstat 512, 0x200)
>DIED. FAILED tests 4-8
> Failed 5/8 tests, 37.50% okay
>t\old-relbase.......ok
>t\pop...............ok
>t\roy-test..........ok
>Failed Test  Status Wstat Total Fail  Failed  List of failed
>----------------------------------------------------------------------------
>---
>t\old-base.t      2   512     8    5  62.50%  4-8
>Failed 1/14 test scripts, 92.86% okay. 5/295 subtests failed, 98.31% okay.

Hi,
   I'm not sure what the "bad command or filename" messages mean -
they appear for some of your tests that passed, too. On my Windows 98
machine I didn't get those messages, but I did get the same error for
the old-base test, using a native perl build and also a recent
ActiveState build. Also, at least one other person on the
libwww-perl mailing list reported the same problem. I sent a message
to that list about this, but haven't seen a fix yet.

--
                Best regards,
                Randy Kobes

Physics Department              Phone:     (204) 786-9399
University of Winnipeg          Fax:       (204) 774-4134

Canada                          http://theory.uwinnipeg.ca/



Tue, 24 Jul 2001 03:00:00 GMT  
 
 [ 2 post ] 

 Relevant Pages 

1. Problem Installing GAAS/URI-1.05.tar.gz

2. Cant gunzip pmtools-1.00.tar.gz

3. Distribution: GAAS/URI-1.06.tar.gz Error

4. Announce: ColourChooser-1.00.tar.gz + ETC

5. ActivePerl 509 and Win32::GUI

6. Install problems: Msql-Mysql-modules-1.2207.tar.gz

7. libwin32-0_13.tar.gz link errors under NT

8. ANNOUNCE: VCS::LibCVS 1.00.00

9. DBD-Pg-1.00 install problems

10. problem installing libxml-enno-1.00

11. DB_File module error msg's in conjunction with netscape-history3.00

12. DB_File module errors in conjunction with netscape-history3.00

 

 
Powered by phpBB® Forum Software